Information card for entry 1525686
Formula |
Ba8 Ga16 Ge30 |
Calculated formula |
Ba8 Ga16 Ge30 |
Title of publication |
Structure and stability of the clathrates Ba8 Ga16 Ge30, Sr8 Ga16 Ge30, Ba8 Ga16 Si30, and Ba8 In16 Sn30 |
Authors of publication |
Blake, N.P.; Bryan, D.; Metiu, H.; Mollnitz, L.; Stucky, G.D.; Latturner, S. |
Journal of publication |
Journal of Chemical Physics |
Year of publication |
2001 |
Journal volume |
114 |
Pages of publication |
10063 - 10074 |
a |
10.793 Å |
b |
10.793 Å |
c |
10.793 Å |
α |
90° |
β |
90° |
γ |
90° |
Cell volume |
1257.26 Å3 |
Number of distinct elements |
3 |
Space group number |
223 |
Hermann-Mauguin space group symbol |
P m -3 n |
Hall space group symbol |
-P 4n 2 3 |
Yes |
No |
No |