Information card for entry 1525803
Chemical name |
La (Ba1.3 La0.7) Cu3 O7.3 |
Formula |
Ba1.3 Cu3 La1.7 O7.3 |
Calculated formula |
Ba1.3 Cu3 La1.7 O7.3 |
Title of publication |
Crystallographic and physical properties of new orthorhombic Cu-1212 R (Ba2-x R'x) Cu3 O7+y system (R, R' = La, Pr, Nd; 0.65 < x < 1) |
Authors of publication |
Lin, B.N.; Lin, Y.-H.; Luo, H.M.; Lee, T.-J.; Ho, J.C.; Ku, H.C. |
Journal of publication |
Physica C (Amsterdam) |
Year of publication |
2000 |
Journal volume |
341 |
Pages of publication |
407 - 410 |
a |
5.52 Å |
b |
5.5252 Å |
c |
11.6676 Å |
α |
90° |
β |
90° |
γ |
90° |
Cell volume |
355.851 Å3 |
Number of distinct elements |
4 |
Space group number |
65 |
Hermann-Mauguin space group symbol |
C m m m |
Hall space group symbol |
-C 2 2 |
Yes |
No |
No |