Information card for entry 1526388
Chemical name
Rb Er2 Cu3 S5
Formula
Cu3 Er2 Rb S5
Calculated formula
Cu3 Er2 Rb S5
Title of publication
Syntheses, structures and physical properties of the new quaternaryrare-earth chalcogenides Rb Nd2 Cu S4, Rb Sm2 Cu S4, Cs La2 Cu Se4, Cs Sm2 Cu Se4, Rb Er2 Cu3 S5, Cs Gd2 Ag3 Se5, Cs Tb2 Ag3 Se5 and Rb2 Gd4 Cu4 S9
Authors of publication
Huang, F.Q.; Ibers, J.A.
Journal of publication
Journal of Solid State Chemistry
Year of publication
2001
Journal volume
158
Pages of publication
299 - 306
a
3.9283 Å
b
13.897 Å
c
16.348 Å
α
90°
β
90°
γ
90°
Cell volume
892.463 Å3
Number of distinct elements
4
Space group number
63
Hermann-Mauguin space group symbol
C m c m
Hall space group symbol
-C 2c 2
Yes
No
No