Information card for entry 1528117
Chemical name |
(Cu0.7 Ga0.3)5 U |
Formula |
Cu3.5 Ga1.5 U |
Calculated formula |
Cu3.5 Ga1.5 U |
Title of publication |
Structural and physical properties of new U-T-Ga compounds (T= Ni, Cu and Pd) |
Authors of publication |
Talabatake, T.; Date, M.; Fujii, H.; Maeda, Y.; Minami, A.; Ikeda, S.; Fujita, T.; Nishigori, S.; Sugiyama, K.; Oguro, I.; Oda, K. |
Journal of publication |
Physik (Berlin) |
Year of publication |
1993 |
Journal volume |
186 |
Pages of publication |
734 - 737 |
a |
5.097 Å |
b |
5.097 Å |
c |
4.148 Å |
α |
90° |
β |
90° |
γ |
120° |
Cell volume |
93.325 Å3 |
Number of distinct elements |
3 |
Space group number |
191 |
Hermann-Mauguin space group symbol |
P 6/m m m |
Hall space group symbol |
-P 6 2 |
Yes |
No |
No |