Information card for entry 1529082
Formula | C63 H69 N7 O6 |
Calculated formula | C63 H69 N7 O6 |
Title of publication | A crystalline sponge based on dispersive forces suitable for X-ray structure determination of included molecular guests |
Authors of publication | Sanna, Elena; Escudero-Adán, Eduardo C.; Bauzá, Antonio; Ballester, Pablo; Frontera, Antonio; Rotger, Carmen; Costa, Antonio |
Journal of publication | Chem. Sci. |
Year of publication | 2015 |
Journal volume | 6 |
Journal issue | 10 |
Pages of publication | 5466 |
a | 34.875 ± 0.004 Å |
b | 5.794 ± 0.0006 Å |
c | 28.028 ± 0.003 Å |
α | 90° |
β | 98.453 ± 0.002° |
γ | 90° |
Cell volume | 5602 ± 1.1 Å3 |
Cell temperature | 100 ± 2 K |
Ambient diffraction temperature | 100 ± 2 K |
Number of distinct elements | 4 |
Space group number | 15 |
Hermann-Mauguin space group symbol | C 1 2/c 1 |
Hall space group symbol | -C 2yc |
Residual factor for all reflections | 0.0742 |
Residual factor for significantly intense reflections | 0.061 |
Weighted residual factors for significantly intense reflections | 0.1765 |
Weighted residual factors for all reflections included in the refinement | 0.1876 |
Goodness-of-fit parameter for all reflections included in the refinement | 1.056 |
Diffraction radiation wavelength | 0.71073 Å |
Diffraction radiation type | MoKα |