Information card for entry 1529233
Chemical name |
Catena-(mu~4~-thiobarbiturato-O,O,O',S)lithium |
Formula |
C8 H11 Li N2 O2 S |
Calculated formula |
C8 H11 Li N2 O2 S |
Title of publication |
The cis-trans isomer transformation, spectroscopic and thermal properties of Li, Na, K 1,3-diethyl-2-thiobarbiturate complexes |
Authors of publication |
Golovnev, Nikolay; Molokeev, Maxim; Vereshchagin, Sergey; Sterkhova, Irina; Atuchin, Victor |
Journal of publication |
Polyhedron |
Year of publication |
2015 |
Journal volume |
85 |
Journal issue |
0 |
Pages of publication |
493 |
a |
10.6778 ± 0.0013 Å |
b |
7.2687 ± 0.0009 Å |
c |
13.2021 ± 0.0016 Å |
α |
90° |
β |
108.841 ± 0.002° |
γ |
90° |
Cell volume |
969.8 ± 0.2 Å3 |
Cell temperature |
298 ± 2 K |
Ambient diffraction temperature |
298 ± 2 K |
Number of distinct elements |
6 |
Space group number |
14 |
Hermann-Mauguin space group symbol |
P 1 21/n 1 |
Hall space group symbol |
-P 2yn |
Residual factor for all reflections |
0.0939 |
Residual factor for significantly intense reflections |
0.0462 |
Weighted residual factors for significantly intense reflections |
0.0945 |
Weighted residual factors for all reflections included in the refinement |
0.1103 |
Goodness-of-fit parameter for all reflections included in the refinement |
1.015 |
Diffraction radiation wavelength |
0.71073 Å |
Diffraction radiation type |
MoKα |
Yes |
No |
Yes |