Information card for entry 1529348
Chemical name | (PNP)Ir(H)(Bpin) |
Formula | C32 H53 B Ir N O2 P2 |
Calculated formula | C32 H53 B Ir N O2 P2 |
SMILES | [IrH]12([P](c3c(N2c2ccc(cc2[P]1(C(C)C)C(C)C)C)ccc(c3)C)(C(C)C)C(C)C)B1OC(C(O1)(C)C)(C)C |
Title of publication | Ligand survey results in identification of PNP pincer complexes of iridium as long-lived and chemoselective catalysts for dehydrogenative borylation of terminal alkynes |
Authors of publication | Lee, Chun-I; DeMott, Jessica C.; Pell, Christopher J.; Christopher, Alyson; Zhou, Jia; Bhuvanesh, Nattamai; Ozerov, Oleg V. |
Journal of publication | Chem. Sci. |
Year of publication | 2015 |
Journal volume | 6 |
Journal issue | 11 |
Pages of publication | 6572 |
a | 14.792 ± 0.003 Å |
b | 17.546 ± 0.002 Å |
c | 14.1242 ± 0.0019 Å |
α | 90° |
β | 110.435 ± 0.006° |
γ | 90° |
Cell volume | 3435.1 ± 0.9 Å3 |
Cell temperature | 110 ± 2 K |
Ambient diffraction temperature | 110 ± 2 K |
Number of distinct elements | 7 |
Space group number | 14 |
Hermann-Mauguin space group symbol | P 1 21/c 1 |
Hall space group symbol | -P 2ybc |
Residual factor for all reflections | 0.0382 |
Residual factor for significantly intense reflections | 0.0303 |
Weighted residual factors for significantly intense reflections | 0.0707 |
Weighted residual factors for all reflections included in the refinement | 0.0726 |
Goodness-of-fit parameter for all reflections included in the refinement | 0.925 |
Diffraction radiation wavelength | 1.54178 Å |
Diffraction radiation type | CuKα |