Information card for entry 1529403
Formula | C57 H79 Br2 N4 Si2 |
Calculated formula | C57 H79 Br2 N4 Si2 |
SMILES | Br[Si]([Si](Br)=C1N(C=CN1c1c(cccc1C(C)C)C(C)C)c1c(cccc1C(C)C)C(C)C)=C1N(C=CN1c1c(cccc1C(C)C)C(C)C)c1c(cccc1C(C)C)C(C)C.CCCCCC |
Title of publication | Silicon(i) chemistry: the NHC-stabilised silicon(i) halides Si2X2(Idipp)2(X = Br, I) and the disilicon(i)-iodido cation [Si2(I)(Idipp)2]+ |
Authors of publication | Arz, Marius I.; Geiß, Daniel; Straßmann, Martin; Schnakenburg, Gregor; Filippou, Alexander C. |
Journal of publication | Chem. Sci. |
Year of publication | 2015 |
Journal volume | 6 |
Journal issue | 11 |
Pages of publication | 6515 |
a | 38.86 ± 0.002 Å |
b | 15.6626 ± 0.0009 Å |
c | 22.7308 ± 0.0017 Å |
α | 90° |
β | 125.774 ± 0.003° |
γ | 90° |
Cell volume | 11224.8 ± 1.3 Å3 |
Cell temperature | 123 ± 2 K |
Ambient diffraction temperature | 123 ± 2 K |
Number of distinct elements | 5 |
Space group number | 15 |
Hermann-Mauguin space group symbol | C 1 2/c 1 |
Hall space group symbol | -C 2yc |
Residual factor for all reflections | 0.0867 |
Residual factor for significantly intense reflections | 0.0429 |
Weighted residual factors for significantly intense reflections | 0.0811 |
Weighted residual factors for all reflections included in the refinement | 0.095 |
Goodness-of-fit parameter for all reflections included in the refinement | 1.006 |
Diffraction radiation wavelength | 0.71073 Å |
Diffraction radiation type | MoKα |