Information card for entry 1529760
Chemical name |
Sn Mo6 S8 |
Formula |
Mo6 S8 Sn |
Calculated formula |
Mo6 S8 Sn |
Title of publication |
The structure of Sn Mo6 S8 and the superconducting properties of the series Snx Mo6 S8 and My Snx Mo6 S8 (M = La, Ce, Pr, Eu, Gd, Ho, Lu, Y, In, U) |
Authors of publication |
Chevrel, R.; Rossel, C.; Sergent, M. |
Journal of publication |
Journal of the Less-Common Metals |
Year of publication |
1980 |
Journal volume |
72 |
Pages of publication |
31 - 43 |
a |
6.527 Å |
b |
6.527 Å |
c |
6.527 Å |
α |
89.7° |
β |
89.7° |
γ |
89.7° |
Cell volume |
278.05 Å3 |
Number of distinct elements |
3 |
Space group number |
148 |
Hermann-Mauguin space group symbol |
R -3 :R |
Hall space group symbol |
-P 3* |
Yes |
No |
No |