Information card for entry 1530696
Formula | C27 H21 N1.5 O6 P1.5 |
Calculated formula | C27 H21 N1.5 O6 P1.5 |
Title of publication | Multifaceted glycodendrimers with programmable bioactivity through convergent, divergent, and accelerated approaches using polyfunctional cyclotriphosphazenes |
Authors of publication | Abbassi, Leïla; Chabre, Yoann M.; Kottari, Naresh; Arnold, Alexandre A.; André, Sabine; Josserand, Johan; Gabius, Hans-Joachim; Roy, René |
Journal of publication | Polym. Chem. |
Year of publication | 2015 |
Journal volume | 6 |
Journal issue | 44 |
Pages of publication | 7666 |
a | 18.901 ± 0.002 Å |
b | 7.5595 ± 0.0009 Å |
c | 17.833 ± 0.002 Å |
α | 90° |
β | 111.235 ± 0.002° |
γ | 90° |
Cell volume | 2375 ± 0.5 Å3 |
Cell temperature | 150 ± 2 K |
Ambient diffraction temperature | 150 ± 2 K |
Number of distinct elements | 5 |
Space group number | 5 |
Hermann-Mauguin space group symbol | C 1 2 1 |
Hall space group symbol | C 2y |
Residual factor for all reflections | 0.0366 |
Residual factor for significantly intense reflections | 0.031 |
Weighted residual factors for significantly intense reflections | 0.0667 |
Weighted residual factors for all reflections included in the refinement | 0.0693 |
Goodness-of-fit parameter for all reflections included in the refinement | 1.022 |
Diffraction radiation wavelength | 0.71073 Å |
Diffraction radiation type | MoKα |