Information card for entry 1531233
Chemical name |
(Pr0.6 Sr0.4) (Mn O3) |
Formula |
Mn O3 Pr0.6 Sr0.4 |
Calculated formula |
Mn O3 Pr0.6 Sr0.4 |
Title of publication |
Neutron diffraction, NMR and magneto-transport properties in the Pr0.6 Sr0.4 Mn O3 perovskite manganite |
Authors of publication |
Boujelben, W.; Ellouze, M.; Cheikhrouhou, A.; Cai, Q.; Pierre, J.; Yelon, W.B.; Shimizu, K.; Dubourdieu, C. |
Journal of publication |
Journal of Alloys Compd. |
Year of publication |
2002 |
Journal volume |
334 |
Pages of publication |
1 - 8 |
a |
5.446 Å |
b |
7.6796 Å |
c |
5.4892 Å |
α |
90° |
β |
90° |
γ |
90° |
Cell volume |
229.575 Å3 |
Number of distinct elements |
4 |
Space group number |
62 |
Hermann-Mauguin space group symbol |
P n m a |
Hall space group symbol |
-P 2ac 2n |
Yes |
No |
No |