Information card for entry 1531426
Chemical name |
Ni4 (As9.1 Ge2.9) |
Formula |
As9.1 Ge2.9 Ni4 |
Calculated formula |
As9.096 Ge2.904 Ni4 |
Title of publication |
A novel skutterudite phase in the Ni - Sb - Sn system: phase equilibria and physical properties |
Authors of publication |
Grytsiv, A.V.; Rogl, P.; Knoll, P.; Paul, C.; Berger, S.; Lottermoser, W.; Musso, M.; Bauer, E.; Michor, H.; Hilscher, G.; Godart, C.; Saccone, A.; Ferro, R.; Roisnel, T.; Noel, H. |
Journal of publication |
Journal of Physics: Condensed Matter |
Year of publication |
2002 |
Journal volume |
14 |
Pages of publication |
7071 - 7090 |
a |
8.2873 Å |
b |
8.2873 Å |
c |
8.2873 Å |
α |
90° |
β |
90° |
γ |
90° |
Cell volume |
569.166 Å3 |
Number of distinct elements |
3 |
Space group number |
204 |
Hermann-Mauguin space group symbol |
I m -3 |
Hall space group symbol |
-I 2 2 3 |
Yes |
No |
No |