Information card for entry 1531633
Chemical name |
(Cr0.62 Cu0.38) (Sr1.80 La0.20) (La0.54 Ca0.46) Cu2 O7.78 |
Formula |
Ca0.46 Cr0.62 Cu2.38 La0.74 O7.78 Sr1.8 |
Calculated formula |
Ca0.46 Cr0.62 Cu2.38 La0.74 O7.78 Sr1.8 |
Title of publication |
Crystal structure of (Cr, Cu) (Sr, La)2 (La, A) Cu2 O8-d (1212- type) and (Cr, Cu) Sr2 (Y, Ce)2 Cu2 O10-d (1222-type) phases |
Authors of publication |
Kuz'micheva, G.M.; Esaulova, Yu.V.; Alsarraf, A.H.R.M.; Andreenko, A.S.; Palewski, T.; Kostyleva, I.E.; Khlybov, E.P. |
Journal of publication |
Crystal Research and Technology |
Year of publication |
2002 |
Journal volume |
37 |
Pages of publication |
612 - 626 |
a |
3.8872 Å |
b |
3.8872 Å |
c |
11.521 Å |
α |
90° |
β |
90° |
γ |
90° |
Cell volume |
174.086 Å3 |
Number of distinct elements |
6 |
Space group number |
123 |
Hermann-Mauguin space group symbol |
P 4/m m m |
Hall space group symbol |
-P 4 2 |
Yes |
No |
No |