Information card for entry 1532114
Chemical name
(Y0.33 Nd0.23 Ce0.44) Al (S O4)2 (C2 O4) (H2 O)12
Formula
C2 H24 Al Ce0.44 Nd0.23 O24 S2 Y0.33
Calculated formula
C2 H24 Al Ce0.44 Nd0.23 O24 S2 Y0.33
Title of publication
The new minerals levinsonite-(Y), ((Y, Nd, Ce) Al (S O4)2 (C2 O4) * 12(H2 O)) and zugshunstite-(Ce), ((Ce, Nd, la) Al (S O4)2 (C2 O4) * 12(H2 O)): coexisting oxalates with different structures and differentiation of LREE and HREE
Authors of publication
Rouse, R.C.; Peacor, D.R.; Essene, E.J.; Coskren, T.D.; Lauf, R.J.
Journal of publication
Geochimica et Cosmochimica Acta
Year of publication
2001
Journal volume
65
Pages of publication
1101 - 1115
a
10.289 Å
b
9.234 Å
c
11.015 Å
α
90°
β
108.5°
γ
90°
Cell volume
992.44 Å3
Number of distinct elements
8
Space group number
13
Hermann-Mauguin space group symbol
P 1 2/n 1
Hall space group symbol
-P 2yac
Yes
No
No