Information card for entry 1532648
Chemical name |
La (Ga0.5 Ni0.5) O3 |
Formula |
Ga0.5 La Ni0.5 O3 |
Calculated formula |
Ga0.5 La Ni0.5 O3 |
Title of publication |
Structural characterization of mixed conducting perovskites La (Ga,M) O3-d (M = Mn, Fe, Co, Ni) |
Authors of publication |
Vyshatko, N.P.; Kharton, V.; Shaula, A.L.; Marques, F.M.B.; Naumovich, E.N. |
Journal of publication |
Materials Research Bulletin |
Year of publication |
2003 |
Journal volume |
38 |
Pages of publication |
185 - 193 |
a |
5.492 Å |
b |
5.492 Å |
c |
13.224 Å |
α |
90° |
β |
90° |
γ |
120° |
Cell volume |
345.426 Å3 |
Number of distinct elements |
4 |
Space group number |
167 |
Hermann-Mauguin space group symbol |
R -3 c :H |
Hall space group symbol |
-R 3 2"c |
Yes |
No |
No |