Information card for entry 1533038
Chemical name |
La0.9 Dy0.3 Ca0.6 Ba1.2 Cu2.977 O7.004 |
Formula |
Ba1.2 Ca0.6 Cu2.977 Dy0.3 La0.9 O7.004 |
Calculated formula |
Ba1.2 Ca0.6 Cu2.978 Dy0.3 La0.9 O7.005 |
Title of publication |
Structural studies and Tc dependence in La2-x Dyx Cay Ba2 Cu4+y Oz type mixed superconductors |
Authors of publication |
Rayaprol, S.; Mavani, K.; Thaker, C.M.; Ramanadham, M.; Chakravorty, K.; Rana, D.S.; Kuberkar, D.G.; Kulkarni, N.A.; Paranjpe, S.K. |
Journal of publication |
Pramana, Journal of Physics |
Year of publication |
2002 |
Journal volume |
58 |
Pages of publication |
877 - 880 |
a |
3.867 Å |
b |
3.867 Å |
c |
11.6766 Å |
α |
90° |
β |
90° |
γ |
90° |
Cell volume |
174.608 Å3 |
Number of distinct elements |
6 |
Space group number |
123 |
Hermann-Mauguin space group symbol |
P 4/m m m |
Hall space group symbol |
-P 4 2 |
Yes |
No |
No |