Information card for entry 1533564
Chemical name |
Sr (Mo O4) |
Formula |
Mo O4 Sr |
Calculated formula |
Mo O4 Sr |
Title of publication |
Synthesis, structural and magnetic characterisation of the double perovskite A2 Mn Mo O6 (A = Ba, Sr) |
Authors of publication |
Azad, A.K.; Eriksson, S.G.; Ivanov, S.A.; Svedlindh, P.; Mathieu, R.; Eriksen, J.; Rundlof, H. |
Journal of publication |
Journal of Alloys Compd. |
Year of publication |
2004 |
Journal volume |
364 |
Pages of publication |
77 - 82 |
a |
5.3897 Å |
b |
5.3897 Å |
c |
12.0209 Å |
α |
90° |
β |
90° |
γ |
90° |
Cell volume |
349.194 Å3 |
Number of distinct elements |
3 |
Space group number |
88 |
Hermann-Mauguin space group symbol |
I 41/a :2 |
Hall space group symbol |
-I 4ad |
Yes |
No |
No |