Information card for entry 1533566
Chemical name |
Gd2 Zn6 Ge3 |
Formula |
Gd2 Ge3 Zn6 |
Calculated formula |
Gd2 Ge3 Zn6 |
Title of publication |
Novel (Zn9)-cluster compounds RE2 Zn6 Ge3 (RE = La, Ce, Pr, Nd, Sm,Gd): crystal structure and physical properties |
Authors of publication |
Grytsiv, A.V.; Noel, H.; Berger, S.; Bauer, E.; Michor, H.; Keller, L.; Hilscher, G.; Rogl, P.; Paul, C.; Roisnel, T.; Daoud-Aladine, A. |
Journal of publication |
Journal of Physics: Condensed Matter |
Year of publication |
2003 |
Journal volume |
15 |
Pages of publication |
3053 - 3067 |
a |
7.5939 Å |
b |
7.5939 Å |
c |
4.0295 Å |
α |
90° |
β |
90° |
γ |
120° |
Cell volume |
201.239 Å3 |
Number of distinct elements |
3 |
Space group number |
189 |
Hermann-Mauguin space group symbol |
P -6 2 m |
Hall space group symbol |
P -6 -2 |
Yes |
No |
No |