Information card for entry 1533568
Chemical name |
Ba2 (Mn Mo O6) |
Formula |
Ba2 Mn Mo O6 |
Calculated formula |
Ba2 Mn Mo O6 |
Title of publication |
Synthesis, structural and magnetic characterisation of the double perovskite A2 Mn Mo O6 (A = Ba, Sr) |
Authors of publication |
Azad, A.K.; Mathieu, R.; Ivanov, S.A.; Eriksson, S.G.; Svedlindh, P.; Rundlof, H.; Eriksen, J. |
Journal of publication |
Journal of Alloys Compd. |
Year of publication |
2004 |
Journal volume |
364 |
Pages of publication |
77 - 82 |
a |
8.168 Å |
b |
8.168 Å |
c |
8.168 Å |
α |
90° |
β |
90° |
γ |
90° |
Cell volume |
544.938 Å3 |
Number of distinct elements |
4 |
Space group number |
225 |
Hermann-Mauguin space group symbol |
F m -3 m |
Hall space group symbol |
-F 4 2 3 |
Yes |
No |
No |