Information card for entry 1533999
Chemical name |
Pr5 Ni1.9 Si3 |
Formula |
Ni1.9 Pr5 Si3 |
Calculated formula |
Ni1.906 Pr5 Si3 |
Title of publication |
Preparation, crystal structure, heat capacity, magnetism and the magnetocaloric effect of Pr5 Ni1.9 Si3 and Pr Ni |
Authors of publication |
Pecharsky, A.O.; Mozharivsky, Yu.; Dennis, K.W.; Gschneidner, K.A.jr.; McCallum, R.W.; Pecharskii, V.K.; Miller, G.J. |
Journal of publication |
Physical Review, Serie 3. B - Condensed Matter (18,1978-) |
Year of publication |
2003 |
Journal volume |
68 |
Pages of publication |
134452-1 - 134452-8 |
a |
15.9268 Å |
b |
15.9268 Å |
c |
4.2553 Å |
α |
90° |
β |
90° |
γ |
120° |
Cell volume |
934.798 Å3 |
Number of distinct elements |
3 |
Space group number |
176 |
Hermann-Mauguin space group symbol |
P 63/m |
Hall space group symbol |
-P 6c |
Yes |
No |
No |