Information card for entry 1534060
Chemical name |
Ho3 (Ga O4) O2 |
Formula |
Ga Ho3 O6 |
Calculated formula |
Ga Ho3 O6 |
Title of publication |
A systematic study on crystal structure and magnetic properties of Ln3 Ga O6 (Ln = Nd, Sm, Eu, Gd, Tb, Dy, Ho and Er) |
Authors of publication |
Liu, F.S.; Luo, J.; Liu, Q.L.; Liang, J.K.; Yang, L.T.; Rao, G.H.; Song, G.B. |
Journal of publication |
Journal of Solid State Chemistry |
Year of publication |
2004 |
Journal volume |
177 |
Pages of publication |
1796 - 1802 |
a |
8.8451 Å |
b |
11.0931 Å |
c |
5.4027 Å |
α |
90° |
β |
90° |
γ |
90° |
Cell volume |
530.111 Å3 |
Number of distinct elements |
3 |
Space group number |
36 |
Hermann-Mauguin space group symbol |
C m c 21 |
Hall space group symbol |
C 2c -2 |
Yes |
No |
No |