Information card for entry 1534127
Formula | C17 H15 N O3 |
Calculated formula | C17 H15 N O3 |
SMILES | O=C1C2(OC2)C=C2C(=C1)N(C(=O)C2(C)C)c1ccccc1 |
Title of publication | A bio-inspired synthesis of oxindoles by catalytic aerobic dual C‒H functionalization of phenols |
Authors of publication | Huang, Zheng; Askari, Mohammad S.; Esguerra, Kenneth Virgel N.; Dai, Tian-Yang; Kwon, Ohhyeon; Ottenwaelder, Xavier; Lumb, Jean-Philip |
Journal of publication | Chem. Sci. |
Year of publication | 2016 |
Journal volume | 7 |
Journal issue | 1 |
Pages of publication | 358 |
a | 5.792 ± 0.003 Å |
b | 23.556 ± 0.009 Å |
c | 11.041 ± 0.005 Å |
α | 90° |
β | 113.83 ± 0.03° |
γ | 90° |
Cell volume | 1378 ± 1.1 Å3 |
Cell temperature | 150 ± 2 K |
Ambient diffraction temperature | 150 ± 2 K |
Number of distinct elements | 4 |
Space group number | 14 |
Hermann-Mauguin space group symbol | P 1 21/c 1 |
Hall space group symbol | -P 2ybc |
Residual factor for all reflections | 0.0458 |
Residual factor for significantly intense reflections | 0.0392 |
Weighted residual factors for significantly intense reflections | 0.1006 |
Weighted residual factors for all reflections included in the refinement | 0.1056 |
Goodness-of-fit parameter for all reflections included in the refinement | 1.07 |
Diffraction radiation wavelength | 1.54178 Å |
Diffraction radiation type | CuKα |