Information card for entry 1534129
Formula | C23 H19 N O4 |
Calculated formula | C23 H19 N O4 |
SMILES | O=C1C(=O)C(=C2N(C(=O)C(C2=C1)(C)C)c1ccccc1)c1ccc(OC)cc1 |
Title of publication | A bio-inspired synthesis of oxindoles by catalytic aerobic dual C‒H functionalization of phenols |
Authors of publication | Huang, Zheng; Askari, Mohammad S.; Esguerra, Kenneth Virgel N.; Dai, Tian-Yang; Kwon, Ohhyeon; Ottenwaelder, Xavier; Lumb, Jean-Philip |
Journal of publication | Chem. Sci. |
Year of publication | 2016 |
Journal volume | 7 |
Journal issue | 1 |
Pages of publication | 358 |
a | 7.6287 ± 0.0009 Å |
b | 11.5801 ± 0.0013 Å |
c | 20.615 ± 0.002 Å |
α | 90° |
β | 90° |
γ | 90° |
Cell volume | 1821.2 ± 0.3 Å3 |
Cell temperature | 150 ± 2 K |
Ambient diffraction temperature | 150 ± 2 K |
Number of distinct elements | 4 |
Space group number | 19 |
Hermann-Mauguin space group symbol | P 21 21 21 |
Hall space group symbol | P 2ac 2ab |
Residual factor for all reflections | 0.0565 |
Residual factor for significantly intense reflections | 0.0391 |
Weighted residual factors for significantly intense reflections | 0.0765 |
Weighted residual factors for all reflections included in the refinement | 0.0829 |
Goodness-of-fit parameter for all reflections included in the refinement | 1.059 |
Diffraction radiation wavelength | 0.71073 Å |
Diffraction radiation type | MoKα |