Information card for entry 1534581
Chemical name |
K7 Na9 (Pt O (H2 O) (P W9 O34)2) (H2 O)21.5 |
Formula |
H45 K7 Na9 O91.5 P2 Pt W18 |
Calculated formula |
K7 Na9 O91.5 P2 Pt W18 |
Title of publication |
A Late-Transition Metal Oxo Complex: K7 Na9 [O=PtIV (H2 O)L2], L = [P W9 O34]9- |
Authors of publication |
Anderson, T.M.; Neiwert, W.A.; Kirk, M.L.; Rui Cao,; Piccoli, P.M.B.; Schultz, A.J.; Koetzle, F.; Hill, C.L.; Keiji Morokuma,; Musaev, D.G. |
Journal of publication |
Science |
Year of publication |
2004 |
Journal volume |
306 |
Pages of publication |
2074 - 2077 |
a |
28.596 Å |
b |
31.788 Å |
c |
38.347 Å |
α |
90° |
β |
90° |
γ |
90° |
Cell volume |
34857.8 Å3 |
Number of distinct elements |
7 |
Space group number |
70 |
Hermann-Mauguin space group symbol |
F d d d :2 |
Hall space group symbol |
-F 2uv 2vw |
Yes |
No |
No |