Information card for entry 1534765
Chemical name |
Tb Rh In |
Formula |
In Rh Tb |
Calculated formula |
In Rh Tb |
Title of publication |
Synthesis and Crystal Structures of RERhIn (RE = Sm, Tb, Ho, Er, Tm, Yb, Lu) |
Authors of publication |
Lukachuk, M.; Zaremba, V.I.; Poettgen, R. |
Journal of publication |
Intermetallics |
Year of publication |
2003 |
Journal volume |
11 |
Pages of publication |
581 - 587 |
a |
7.48 Å |
b |
7.48 Å |
c |
3.904 Å |
α |
90° |
β |
90° |
γ |
120° |
Cell volume |
189.166 Å3 |
Number of distinct elements |
3 |
Space group number |
189 |
Hermann-Mauguin space group symbol |
P -6 2 m |
Hall space group symbol |
P -6 -2 |
Yes |
No |
No |