Information card for entry 1535114
Chemical name |
La6 I5 Ge3 |
Formula |
Ge3 I5 La6 |
Calculated formula |
Ge3 I5 La6 |
Title of publication |
Reduced lanthanum halides with Ge as interstitials: La2 I2 Ge, La2 I2 Ge2, La3 Cl2 Ge3, La3 Br2 Ge3, La3 I3 Ge, La6 I5 Ge3 and La(7+x) I12 Ge |
Authors of publication |
Mattausch, H.J.; Simon, A.; Zheng, C.; Ryazanov, M. |
Journal of publication |
Zeitschrift fuer Anorganische und Allgemeine Chemie |
Year of publication |
2005 |
Journal volume |
631 |
Pages of publication |
302 - 308 |
a |
19.338 Å |
b |
4.423 Å |
c |
14.895 Å |
α |
90° |
β |
128.16° |
γ |
90° |
Cell volume |
1001.73 Å3 |
Number of distinct elements |
3 |
Space group number |
12 |
Hermann-Mauguin space group symbol |
C 1 2/m 1 |
Hall space group symbol |
-C 2y |
Yes |
No |
No |