Information card for entry 1535118
Chemical name |
La7.72 I12 Ge |
Formula |
Ge I12 La7.72 |
Calculated formula |
Ge I12 La7.72 |
Title of publication |
Reduced lanthanum halides with Ge as interstitials: La2 I2 Ge, La2 I2 Ge2, La3 Cl2 Ge3, La3 Br2 Ge3, La3 I3 Ge, La6 I5 Ge3 and La(7+x) I12 Ge |
Authors of publication |
Mattausch, H.J.; Simon, A.; Zheng, C.; Ryazanov, M. |
Journal of publication |
Zeitschrift fuer Anorganische und Allgemeine Chemie |
Year of publication |
2005 |
Journal volume |
631 |
Pages of publication |
302 - 308 |
a |
16.122 Å |
b |
16.122 Å |
c |
10.768 Å |
α |
90° |
β |
90° |
γ |
120° |
Cell volume |
2423.84 Å3 |
Number of distinct elements |
3 |
Space group number |
148 |
Hermann-Mauguin space group symbol |
R -3 :H |
Hall space group symbol |
-R 3 |
Yes |
No |
No |