Information card for entry 1535923
Chemical name |
Ba2 Dy Sb O6 |
Formula |
Ba2 Dy O6 Sb |
Calculated formula |
Ba2 Dy O6 Sb |
Title of publication |
On the Perovskites Ba2 Ln Sb O6 (Ln= Nd, Sm, Eu, Gd, Tb, Dy, Ho, Er, Yb) |
Authors of publication |
Casado, P.G.; Mendiola, A.; Rasines, I. |
Journal of publication |
Zeitschrift fuer Anorganische und Allgemeine Chemie |
Year of publication |
1984 |
Journal volume |
510 |
Pages of publication |
194 - 198 |
a |
8.431 Å |
b |
8.431 Å |
c |
8.431 Å |
α |
90° |
β |
90° |
γ |
90° |
Cell volume |
599.29 Å3 |
Number of distinct elements |
4 |
Space group number |
225 |
Hermann-Mauguin space group symbol |
F m -3 m |
Hall space group symbol |
-F 4 2 3 |
Yes |
No |
No |