Information card for entry 1536574
Chemical name | K10 Na ((As W9 O34)2 (Y (H2 O))3 (C O3)) (H2 O)19 |
Formula | C H44 As2 K10 Na O93 W18 Y3 |
Calculated formula | C As2 K10 Na O93 W18 Y3 |
SMILES | C12=[O]3[Y]4567([OH2])[O]=[W]89%10(=O)O[W]%11%12(=O)(=[O]4)[O]8[As]48=[O]%13%14[W]%15(O9)(O%11)(=O)O[W]9%11%13(=O)O[W]%13%16%17(=O)O[W]([O]4%13)(=O)(O%10)(O%11)=[O][Y]4%103([O]=%17)([OH2])[O]=[W]3%11%13(=O)O[W]%17%18(=O)(=[O]%10)[O]%13[As]%10%13=[O]%19[W]%20(=[O]5)(O%17)(=O)O[W]5%17%21(=O)O[W]%19(=[O]6)(O%20)(=O)O[W]6%19%20(=O)O[W]([O]%10%20)(=O)(O%11)(O[W]%10(O5)([O]%13%17[W](O3)(O%18)(=O)(O%21)O%10)(O6)=O)=[O][Y]3([O]=%19)([OH2])([O]14)([O]27)[O]=[W]12(O%12)(=O)O[W]([O]18)(=O)(O%16)(=[O]3)O[W]%14(O2)(=O)(O9)O%15.[K+].O.[K+].[K+].[K+].[K+].O.O.[Na+].[K+].[K+].[K+].O.O.O.O.O.[K+].O.[K+].O.O.O.O.O.O.O.O.O.O |
Title of publication | Complexes with carbonate as a tridentate ligand: synthesis and characterization of sandwich-type polyoxometallates [(A-alfa-As W9 O34)2 (M O H2)3 (C O3)](11-) (M = Y(III), Yb(III) and Sm(III)) |
Authors of publication | Khoshnavazi, R.; Moaser, A.G.; Salimi, A. |
Journal of publication | Polyhedron |
Year of publication | 2008 |
Journal volume | 27 |
Pages of publication | 1303 - 1309 |
a | 20.7572 Å |
b | 20.7572 Å |
c | 20.7572 Å |
α | 90° |
β | 90° |
γ | 90° |
Cell volume | 8943.47 Å3 |
Number of distinct elements | 8 |
Space group number | 198 |
Hermann-Mauguin space group symbol | P 21 3 |
Hall space group symbol | P 2ac 2ab 3 |