Information card for entry 1536740
Chemical name |
Na3 Rb (Mo O4)2 (H2 O)9 |
Formula |
H18 Mo2 Na3 O17 Rb |
Calculated formula |
H18 Mo2 Na3 O17 Rb |
SMILES |
[Na+].O.O=[Mo](=O)([O-])[O-].[Na+].O.O.[Rb+].O.O.O.O.O.O.[Na+].O=[Mo](=O)([O-])[O-] |
Title of publication |
Double molybdates and tungstates of the composition Na3 M(+) (E O4)2 * 9(H2 O) (M= K, Rb; E= Mo, W): synthesis, structure, dehydratation. |
Authors of publication |
Klevtsova, R.F.; Glinskaya, L.A.; Ishchenko, V.N.; Klevtsov, P.V.; Perepelitsa, A.P. |
Journal of publication |
Kristallografiya |
Year of publication |
1990 |
Journal volume |
35 |
Pages of publication |
1094 - 1098 |
a |
9.648 Å |
b |
9.648 Å |
c |
12.157 Å |
α |
90° |
β |
90° |
γ |
120° |
Cell volume |
980.013 Å3 |
Number of distinct elements |
5 |
Space group number |
176 |
Hermann-Mauguin space group symbol |
P 63/m |
Hall space group symbol |
-P 6c |
Yes |
No |
No |