Information card for entry 1536762
Chemical name |
K5 (Mg0.5 Zr1.5) (Mo O4)6 |
Formula |
K5 Mg0.5 Mo6 O24 Zr1.5 |
Calculated formula |
K5 Mg0.5 Mo6 O24 Zr1.5 |
Title of publication |
Synthesis of triple molybdates of potassium, magnesium, zirconium and K5 (Mg0.5 Zr1.5) (Mo O4)6 structure |
Authors of publication |
Klevtsova, R.F.; Bazarova, Zh.G.; Bazarov, B.G.; Glinskaya, L.A.; Alekseev, V.I.; Arkhincheeva, S.I.; Klevtsov, P.V.; Fedorov, K.N. |
Journal of publication |
Zhurnal Strukturnoi Khimii (Issue-No. from 1981) |
Year of publication |
1994 |
Journal volume |
35 |
Pages of publication |
11 - 15 |
a |
10.576 Å |
b |
10.576 Å |
c |
37.511 Å |
α |
90° |
β |
90° |
γ |
120° |
Cell volume |
3633.56 Å3 |
Number of distinct elements |
5 |
Space group number |
161 |
Hermann-Mauguin space group symbol |
R 3 c :H |
Hall space group symbol |
R 3 -2"c |
Yes |
No |
No |