Information card for entry 1538178
Formula |
Lu Te |
Calculated formula |
Lu Te |
Title of publication |
Sui composti di formula M X formati della terre rare con P, As, Sb, Bi, S, Se, Te del tulio e del lutezio |
Authors of publication |
Iandelli, A. |
Journal of publication |
Atti della Accademia Nazionale dei Lincei, Classe di Fisiche, Matematiche e Naturali, Rendiconti |
Year of publication |
1964 |
Journal volume |
37 |
Pages of publication |
160 - 164 |
a |
5.961 Å |
b |
5.961 Å |
c |
5.961 Å |
α |
90° |
β |
90° |
γ |
90° |
Cell volume |
211.815 Å3 |
Number of distinct elements |
2 |
Space group number |
225 |
Hermann-Mauguin space group symbol |
F m -3 m |
Hall space group symbol |
-F 4 2 3 |
Yes |
No |
No |