Information card for entry 1538753
Chemical name |
Y N |
Formula |
N Y |
Calculated formula |
N Y |
Title of publication |
Phase relations in the ternary systems rare-earth metal (RE)- boron - nitrogen, where RE= Tb, Dy, Ho, Er, Tm, Lu, Sc und Y |
Authors of publication |
Klesnar, H.P.; Rogl, P. |
Journal of publication |
High Temperatures-High Pressures |
Year of publication |
1990 |
Journal volume |
22 |
Pages of publication |
453 - 457 |
a |
4.8935 Å |
b |
4.8935 Å |
c |
4.8935 Å |
α |
90° |
β |
90° |
γ |
90° |
Cell volume |
117.181 Å3 |
Number of distinct elements |
2 |
Space group number |
225 |
Hermann-Mauguin space group symbol |
F m -3 m |
Hall space group symbol |
-F 4 2 3 |
Yes |
No |
No |