Information card for entry 1539275
Formula |
In Rh |
Calculated formula |
In Rh |
Title of publication |
Einige strukturelle Ergebnisse an metallischen Phasen. II |
Authors of publication |
Schubert, K.; Vetter, H.; Burkhardt, W.; Gunzel, E.; Breimer, H.; Lukas, H.L.; Wegst, J.; Haufler, R.; Wilkens, M. |
Journal of publication |
Naturwissenschaften |
Year of publication |
1957 |
Journal volume |
44 |
Pages of publication |
229 - 230 |
a |
3.196 Å |
b |
3.196 Å |
c |
3.196 Å |
α |
90° |
β |
90° |
γ |
90° |
Cell volume |
32.645 Å3 |
Number of distinct elements |
2 |
Space group number |
221 |
Hermann-Mauguin space group symbol |
P m -3 m |
Hall space group symbol |
-P 4 2 3 |
Yes |
No |
No |