Information card for entry 1539609
Chemical name |
(U0.46 Y0.42 Th0.06 Mn0.06) (Ta0.16 Ti0.96 Nb0.84) O6 |
Formula |
Mn0.06 Nb0.84 O6 Ta0.16 Th0.06 Ti0.96 U0.46 Y0.42 |
Calculated formula |
Mn0.06 Nb0.84 O6 Ta0.16 Th0.06 Ti0.96 U0.46 Y0.42 |
Title of publication |
Uranopolycrase, the uranium-dominant analogue of polycrase-(Y), a new mineral from Elba Island, Italy, and its crystal structure |
Authors of publication |
Aurisicchio, C.; Orlandi, P.; Pasero, M.; Perchiazzi, N. |
Journal of publication |
European Journal of Mineralogy (1,1989-) |
Year of publication |
1993 |
Journal volume |
5 |
Pages of publication |
1161 - 1165 |
a |
14.51 Å |
b |
5.558 Å |
c |
5.173 Å |
α |
90° |
β |
90° |
γ |
90° |
Cell volume |
417.185 Å3 |
Number of distinct elements |
8 |
Space group number |
60 |
Hermann-Mauguin space group symbol |
P b c n |
Hall space group symbol |
-P 2n 2ab |
Yes |
No |
No |