Information card for entry 1540018
Formula | C24 H20 Dy2 N2 O17 |
Calculated formula | C24 H20 Dy2 N2 O17 |
Title of publication | Constraining and Tuning the Coordination Geometry of a Lanthanide Ion in Metal-Organic Frameworks: Approach toward a Single-Molecule Magnet. |
Authors of publication | Liu, Ke; Li, Huanhuan; Zhang, Xuejing; Shi, Wei; Cheng, Peng |
Journal of publication | Inorganic chemistry |
Year of publication | 2015 |
Journal volume | 54 |
Journal issue | 21 |
Pages of publication | 10224 - 10231 |
a | 18.3085 ± 0.0013 Å |
b | 9.0788 ± 0.0008 Å |
c | 19.6464 ± 0.0019 Å |
α | 90° |
β | 97.068 ± 0.008° |
γ | 90° |
Cell volume | 3240.8 ± 0.5 Å3 |
Cell temperature | 293 ± 2 K |
Ambient diffraction temperature | 293 ± 2 K |
Number of distinct elements | 5 |
Space group number | 15 |
Hermann-Mauguin space group symbol | C 1 2/c 1 |
Hall space group symbol | -C 2yc |
Residual factor for all reflections | 0.0581 |
Residual factor for significantly intense reflections | 0.0422 |
Weighted residual factors for significantly intense reflections | 0.0844 |
Weighted residual factors for all reflections included in the refinement | 0.092 |
Goodness-of-fit parameter for all reflections included in the refinement | 0.996 |
Diffraction radiation wavelength | 0.71073 Å |
Diffraction radiation type | MoKα |