Information card for entry 1540396
Formula | C34.5 H34 B2 Cd N12 P6 |
Calculated formula | C31 H30 B2 Cd N12 P6 |
Title of publication | The first scorpionate ligand based on diazaphosphole. |
Authors of publication | Mlateček, Martin; Dostál, Libor; Růžičková, Zdeňka; Honzíček, Jan; Holubová, Jana; Erben, Milan |
Journal of publication | Dalton transactions (Cambridge, England : 2003) |
Year of publication | 2015 |
Journal volume | 44 |
Journal issue | 46 |
Pages of publication | 20242 - 20253 |
a | 14.048 ± 0.0007 Å |
b | 14.097 ± 0.0003 Å |
c | 14.1551 ± 0.0012 Å |
α | 66.977 ± 0.003° |
β | 61.712 ± 0.004° |
γ | 61.256 ± 0.003° |
Cell volume | 2115.4 ± 0.2 Å3 |
Cell temperature | 150 ± 1 K |
Ambient diffraction temperature | 150 ± 1 K |
Number of distinct elements | 6 |
Space group number | 2 |
Hermann-Mauguin space group symbol | P -1 |
Hall space group symbol | -P 1 |
Residual factor for all reflections | 0.0429 |
Residual factor for significantly intense reflections | 0.0302 |
Weighted residual factors for significantly intense reflections | 0.0714 |
Weighted residual factors for all reflections included in the refinement | 0.0821 |
Goodness-of-fit parameter for all reflections included in the refinement | 1.104 |
Diffraction radiation wavelength | 0.71073 Å |
Diffraction radiation type | MoKα |