Information card for entry 1540400
Formula | C12 H11 B N6 P3 Tl |
Calculated formula | C12 H11 B N6 P3 Tl |
SMILES | [Tl+].p1cn(nc1)[B-](n1ncpc1)(n1ncpc1)c1ccccc1 |
Title of publication | The first scorpionate ligand based on diazaphosphole. |
Authors of publication | Mlateček, Martin; Dostál, Libor; Růžičková, Zdeňka; Honzíček, Jan; Holubová, Jana; Erben, Milan |
Journal of publication | Dalton transactions (Cambridge, England : 2003) |
Year of publication | 2015 |
Journal volume | 44 |
Journal issue | 46 |
Pages of publication | 20242 - 20253 |
a | 9.144 ± 0.0004 Å |
b | 10.3091 ± 0.0008 Å |
c | 17.5949 ± 0.0008 Å |
α | 90° |
β | 90° |
γ | 90° |
Cell volume | 1658.61 ± 0.17 Å3 |
Cell temperature | 150 ± 1 K |
Ambient diffraction temperature | 150 ± 1 K |
Number of distinct elements | 6 |
Space group number | 62 |
Hermann-Mauguin space group symbol | P n m a |
Hall space group symbol | -P 2ac 2n |
Residual factor for all reflections | 0.0279 |
Residual factor for significantly intense reflections | 0.0208 |
Weighted residual factors for significantly intense reflections | 0.0437 |
Weighted residual factors for all reflections included in the refinement | 0.0464 |
Goodness-of-fit parameter for all reflections included in the refinement | 1.118 |
Diffraction radiation wavelength | 0.71073 Å |
Diffraction radiation type | MoKα |