Information card for entry 1540539
Formula | C65 H86 Mn6 N10 O26 |
Calculated formula | C60 H68 Mn6 N8 O24 |
Title of publication | Supramolecular aggregates of single-molecule magnets: exchange-biased quantum tunneling of magnetization in a rectangular [Mn3]4tetramer |
Authors of publication | Nguyen, Tu N.; Wernsdorfer, Wolfgang; Shiddiq, Muhandis; Abboud, Khalil A.; Hill, Stephen; Christou, George |
Journal of publication | Chem. Sci. |
Year of publication | 2016 |
Journal volume | 7 |
Journal issue | 2 |
Pages of publication | 1156 |
a | 16.0232 ± 0.0017 Å |
b | 41.093 ± 0.004 Å |
c | 13.0506 ± 0.0014 Å |
α | 90° |
β | 110.908 ± 0.002° |
γ | 90° |
Cell volume | 8027.2 ± 1.4 Å3 |
Cell temperature | 100 ± 2 K |
Ambient diffraction temperature | 100 ± 2 K |
Number of distinct elements | 5 |
Space group number | 15 |
Hermann-Mauguin space group symbol | C 1 2/c 1 |
Hall space group symbol | -C 2yc |
Residual factor for all reflections | 0.065 |
Residual factor for significantly intense reflections | 0.046 |
Weighted residual factors for significantly intense reflections | 0.1276 |
Weighted residual factors for all reflections included in the refinement | 0.1337 |
Goodness-of-fit parameter for all reflections included in the refinement | 1.08 |
Diffraction radiation wavelength | 0.71073 Å |
Diffraction radiation type | MoKα |