Information card for entry 1540832
Chemical name |
(Gd0.667 Ce0.333)4 (La0.333 Ba0.667)4 Cu6 O18.4 |
Formula |
Ba2.668 Ce1.332 Cu6 Gd2.668 La1.332 O18.4 |
Calculated formula |
Ba2.668 Ce1.332 Cu6 Gd2.668 La1.332 O18.4 |
Title of publication |
Crystal structure of new oxide superconductors, (Sm, Ba, Ce)8 Cu6 Oz, (Nd, Ba, Sr, Ce)8 Cu6 Oz , (La, Gd, Ba, Ce)8 Cu6 Oz and (La, Gd, Ba, Sr, Ce)8 Cu6 Oz |
Authors of publication |
Wada, T.; Takana, S.; Yaegashi, Y.; Ichinose, A.; Yamauchi, H. |
Journal of publication |
Japanese Journal of Applied Physics, Part 2 |
Year of publication |
1989 |
Journal volume |
28 |
Pages of publication |
1779 - 1782 |
a |
3.8448 Å |
b |
3.8448 Å |
c |
28.383 Å |
α |
90° |
β |
90° |
γ |
90° |
Cell volume |
419.571 Å3 |
Number of distinct elements |
6 |
Space group number |
139 |
Hermann-Mauguin space group symbol |
I 4/m m m |
Hall space group symbol |
-I 4 2 |
Yes |
No |
No |