Information card for entry 1542407
Formula | C59 H82 N2 O3 P2 Si2 U |
Calculated formula | C59 H82 N2 O3 P2 Si2 U |
Title of publication | Emergence of comparable covalency in isostructural cerium(iv)‒ and uranium(iv)‒carbon multiple bonds |
Authors of publication | Gregson, Matthew; Lu, Erli; Tuna, Floriana; McInnes, Eric J. L.; Hennig, Christoph; Scheinost, Andreas C.; McMaster, Jonathan; Lewis, William; Blake, Alexander J.; Kerridge, Andrew; Liddle, Stephen T. |
Journal of publication | Chem. Sci. |
Year of publication | 2016 |
Journal volume | 7 |
Journal issue | 5 |
Pages of publication | 3286 |
a | 18.4956 ± 0.0002 Å |
b | 16.94471 ± 0.00014 Å |
c | 18.98054 ± 0.00016 Å |
α | 90° |
β | 90° |
γ | 90° |
Cell volume | 5948.55 ± 0.1 Å3 |
Cell temperature | 90 ± 2 K |
Ambient diffraction temperature | 90 ± 2 K |
Number of distinct elements | 7 |
Space group number | 62 |
Hermann-Mauguin space group symbol | P n m a |
Hall space group symbol | -P 2ac 2n |
Residual factor for all reflections | 0.0221 |
Residual factor for significantly intense reflections | 0.022 |
Weighted residual factors for significantly intense reflections | 0.0585 |
Weighted residual factors for all reflections included in the refinement | 0.0586 |
Goodness-of-fit parameter for all reflections included in the refinement | 1.12 |
Diffraction radiation wavelength | 1.54184 Å |
Diffraction radiation type | CuKα |