Information card for entry 1542678
Formula | C19 H18 O4 |
Calculated formula | C19 H18 O4 |
SMILES | O=C1c2ccccc2[C@@]2(O[C@@]1(CC)c1c(O2)cc(OC)cc1)C.O=C1c2ccccc2[C@]2(O[C@]1(CC)c1c(O2)cc(OC)cc1)C |
Title of publication | o-Quinone Methides via Oxone-Mediated Benzofuran Oxidative Dearomatization and Their Intramolecular Cycloaddition with Carbonyl Groups: An Expeditious Construction of the Central Tetracyclic Core of Integrastatins, Epicoccolide A, and Epicocconigrone A. |
Authors of publication | More, Atul A.; Ramana, Chepuri V. |
Journal of publication | Organic letters |
Year of publication | 2016 |
Journal volume | 18 |
Journal issue | 3 |
Pages of publication | 612 - 615 |
a | 9.4895 ± 0.0018 Å |
b | 8.7747 ± 0.0017 Å |
c | 19.062 ± 0.004 Å |
α | 90° |
β | 101.174 ± 0.01° |
γ | 90° |
Cell volume | 1557.2 ± 0.5 Å3 |
Cell temperature | 296 ± 2 K |
Ambient diffraction temperature | 296 ± 2 K |
Number of distinct elements | 3 |
Space group number | 14 |
Hermann-Mauguin space group symbol | P 1 21/c 1 |
Hall space group symbol | -P 2ybc |
Residual factor for all reflections | 0.0431 |
Residual factor for significantly intense reflections | 0.0375 |
Weighted residual factors for significantly intense reflections | 0.0993 |
Weighted residual factors for all reflections included in the refinement | 0.1042 |
Goodness-of-fit parameter for all reflections included in the refinement | 1.037 |
Diffraction radiation wavelength | 0.71073 Å |
Diffraction radiation type | MoKα |