Information card for entry 1542892
Chemical name | [Fe(5-Br-salEen)2]ClO4 |
Formula | C22 H28 Br2 Cl Fe N4 O6 |
Calculated formula | C22 H28 Br2 Cl Fe N4 O6 |
SMILES | Brc1ccc2O[Fe]345(Oc6c(C=[N]5CC[NH]4CC)cc(Br)cc6)[N](=Cc2c1)CC[NH]3CC.Cl(=O)(=O)(=O)[O-] |
Title of publication | Dynamic spin interchange in a tridentate Fe(iii) Schiff-base compound |
Authors of publication | Vicente, Ana I.; Joseph, Abhinav; Ferreira, Liliana P.; de Deus Carvalho, Maria; Rodrigues, Vítor H. N.; Duttine, Mathieu; Diogo, Hermínio P.; Minas da Piedade, Manuel E.; Calhorda, Maria José; Martinho, Paulo N. |
Journal of publication | Chem. Sci. |
Year of publication | 2016 |
Journal volume | 7 |
Journal issue | 7 |
Pages of publication | 4251 |
a | 10.3027 ± 0.0004 Å |
b | 14.2644 ± 0.0006 Å |
c | 18.1624 ± 0.0007 Å |
α | 90° |
β | 90° |
γ | 90° |
Cell volume | 2669.18 ± 0.18 Å3 |
Cell temperature | 125 ± 2 K |
Ambient diffraction temperature | 125 ± 2 K |
Number of distinct elements | 7 |
Space group number | 60 |
Hermann-Mauguin space group symbol | P b c n |
Hall space group symbol | -P 2n 2ab |
Residual factor for all reflections | 0.0309 |
Residual factor for significantly intense reflections | 0.0231 |
Weighted residual factors for significantly intense reflections | 0.0575 |
Weighted residual factors for all reflections included in the refinement | 0.061 |
Goodness-of-fit parameter for all reflections included in the refinement | 1.044 |
Diffraction radiation wavelength | 0.71073 Å |
Diffraction radiation type | MoKα |