Information card for entry 1543068
Formula | C28 H29 B F4 N2 O3 |
Calculated formula | C28 H29 B F4 N2 O3 |
Title of publication | Functionalized cationic [4]helicenes with unique tuning of absorption, fluorescence and chiroptical properties up to the far-red range |
Authors of publication | Delgado, I. Hernández; Pascal, S.; Wallabregue, A.; Duwald, R.; Besnard, C.; Guénée, L.; Nançoz, C.; Vauthey, E.; Tovar, R. C.; Lunkley, J. L.; Muller, G.; Lacour, J. |
Journal of publication | Chem. Sci. |
Year of publication | 2016 |
Journal volume | 7 |
Journal issue | 7 |
Pages of publication | 4685 |
a | 22.69881 ± 0.00019 Å |
b | 21.08434 ± 0.00017 Å |
c | 10.5946 ± 0.00009 Å |
α | 90° |
β | 90° |
γ | 90° |
Cell volume | 5070.46 ± 0.07 Å3 |
Cell temperature | 180 ± 0.14 K |
Ambient diffraction temperature | 180 ± 0.14 K |
Number of distinct elements | 6 |
Space group number | 33 |
Hermann-Mauguin space group symbol | P n 21 a |
Hall space group symbol | P -2ac -2n |
Residual factor for all reflections | 0.0546 |
Residual factor for significantly intense reflections | 0.051 |
Weighted residual factors for significantly intense reflections | 0.148 |
Weighted residual factors for all reflections included in the refinement | 0.1533 |
Goodness-of-fit parameter for all reflections included in the refinement | 1.033 |
Diffraction radiation probe | x-ray |
Diffraction radiation wavelength | 1.5418 Å |
Diffraction radiation type | CuKα |