Information card for entry 1543216
Formula | C24 H27 N O7 |
Calculated formula | C24 H27 N O7 |
SMILES | c1ccccc1C(=O)CC1OCC(=O)N1C(C)(C)COC(=O)c1cc(c(cc1)OC)OC |
Title of publication | Synthesis of Oxazolidin-4-ones: Domino O-Alkylation/Aza-Michael/Intramolecular Retro-Claisen Condensation. |
Authors of publication | El Bouakher, Abderrahman; Le Goff, Ronan; Tasserie, Jordan; Lhoste, Jérôme; Martel, Arnaud; Comesse, Sébastien |
Journal of publication | Organic letters |
Year of publication | 2016 |
Journal volume | 18 |
Journal issue | 10 |
Pages of publication | 2383 - 2386 |
a | 22.7748 ± 0.0019 Å |
b | 6.0842 ± 0.0005 Å |
c | 16.1449 ± 0.0016 Å |
α | 90° |
β | 90° |
γ | 90° |
Cell volume | 2237.1 ± 0.3 Å3 |
Cell temperature | 296 ± 2 K |
Ambient diffraction temperature | 296 ± 2 K |
Number of distinct elements | 4 |
Space group number | 29 |
Hermann-Mauguin space group symbol | P c a 21 |
Hall space group symbol | P 2c -2ac |
Residual factor for all reflections | 0.1212 |
Residual factor for significantly intense reflections | 0.0521 |
Weighted residual factors for significantly intense reflections | 0.1105 |
Weighted residual factors for all reflections included in the refinement | 0.1506 |
Goodness-of-fit parameter for all reflections included in the refinement | 0.98 |
Diffraction radiation wavelength | 0.71073 Å |
Diffraction radiation type | MoKα |