Information card for entry 1543811
Formula | C16 H11 N O2 |
Calculated formula | C16 H11 N O2 |
SMILES | O=c1[nH]c2c(cc1)cccc2C(=O)c1ccccc1 |
Title of publication | "One-Pot" Approach to 8-Acylated 2-Quinolinones via Palladium-Catalyzed Regioselective Acylation of Quinoline N-Oxides. |
Authors of publication | Chen, Xiaopei; Cui, Xiuling; Wu, Yangjie |
Journal of publication | Organic letters |
Year of publication | 2016 |
Journal volume | 18 |
Journal issue | 10 |
Pages of publication | 2411 - 2414 |
a | 7.0519 ± 0.0003 Å |
b | 23.5069 ± 0.0009 Å |
c | 7.5339 ± 0.0003 Å |
α | 90° |
β | 90° |
γ | 90° |
Cell volume | 1248.88 ± 0.09 Å3 |
Cell temperature | 291 ± 2 K |
Ambient diffraction temperature | 291.15 K |
Number of distinct elements | 4 |
Space group number | 33 |
Hermann-Mauguin space group symbol | P n a 21 |
Hall space group symbol | P 2c -2n |
Residual factor for all reflections | 0.0467 |
Residual factor for significantly intense reflections | 0.0391 |
Weighted residual factors for significantly intense reflections | 0.0961 |
Weighted residual factors for all reflections included in the refinement | 0.1018 |
Goodness-of-fit parameter for all reflections included in the refinement | 1.039 |
Diffraction radiation probe | x-ray |
Diffraction radiation wavelength | 1.54184 Å |
Diffraction radiation type | CuKα |