Information card for entry 1543842
Formula | C45 H45 N5 O2 Zn |
Calculated formula | C45 H45 N5 O2 Zn |
SMILES | [Zn]123([OH]C)[n]4c5=C(c6c(cc(cc6C)C)C)c6n3c(N(c3[n]2c(=C(c2n1c(cc2)c4cc5)c1c(cc(cc1C)C)C)cc3)Cc1ccccc1)cc6.OC |
Title of publication | Synthesis of Free-Base 10-Azacorroles. |
Authors of publication | Omori, Hiroto; Hiroto, Satoru; Shinokubo, Hiroshi |
Journal of publication | Organic letters |
Year of publication | 2016 |
Journal volume | 18 |
Journal issue | 12 |
Pages of publication | 2978 - 2981 |
a | 19.5138 ± 0.0006 Å |
b | 7.8297 ± 0.0002 Å |
c | 25.5113 ± 0.0008 Å |
α | 90° |
β | 105.181 ± 0.0015° |
γ | 90° |
Cell volume | 3761.77 ± 0.19 Å3 |
Cell temperature | 93 ± 2 K |
Ambient diffraction temperature | 93 ± 2 K |
Number of distinct elements | 5 |
Space group number | 14 |
Hermann-Mauguin space group symbol | P 1 21/c 1 |
Hall space group symbol | -P 2ybc |
Residual factor for all reflections | 0.0576 |
Residual factor for significantly intense reflections | 0.0481 |
Weighted residual factors for significantly intense reflections | 0.1215 |
Weighted residual factors for all reflections included in the refinement | 0.1288 |
Goodness-of-fit parameter for all reflections included in the refinement | 1.038 |
Diffraction radiation wavelength | 0.71073 Å |
Diffraction radiation type | MoKα |