Information card for entry 1544143
Formula | C24 H21 N O |
Calculated formula | C24 H21 N O |
Title of publication | Combining Ru-Catalyzed C-H Functionalization with Pd-Catalyzed Asymmetric Allylic Alkylation: Synthesis of 3-Allyl-3-aryl Oxindole Derivatives from Aryl α-Diazoamides. |
Authors of publication | Yamamoto, Kosuke; Qureshi, Zafar; Tsoung, Jennifer; Pisella, Guillaume; Lautens, Mark |
Journal of publication | Organic letters |
Year of publication | 2016 |
Journal volume | 18 |
Journal issue | 19 |
Pages of publication | 4954 - 4957 |
a | 8.9816 ± 0.0004 Å |
b | 29.4224 ± 0.0015 Å |
c | 13.9309 ± 0.0007 Å |
α | 90° |
β | 90.128 ± 0.003° |
γ | 90° |
Cell volume | 3681.4 ± 0.3 Å3 |
Cell temperature | 147 ± 2 K |
Ambient diffraction temperature | 147 ± 2 K |
Number of distinct elements | 4 |
Space group number | 4 |
Hermann-Mauguin space group symbol | P 1 21 1 |
Hall space group symbol | P 2yb |
Residual factor for all reflections | 0.0549 |
Residual factor for significantly intense reflections | 0.0515 |
Weighted residual factors for significantly intense reflections | 0.1218 |
Weighted residual factors for all reflections included in the refinement | 0.1245 |
Goodness-of-fit parameter for all reflections included in the refinement | 1.057 |
Diffraction radiation wavelength | 1.54178 Å |
Diffraction radiation type | CuKα |