Information card for entry 1544712
Chemical name | RuPY5Me2Cl_PF6 |
Formula | C29 H25 Cl F6 N5 P Ru |
Calculated formula | C29 H26 Cl F6 N5 P Ru |
Title of publication | Fe, Ru, and Os Complexes with the Same Molecular Framework: Comparison of Structures, Properties and Catalytic Activities |
Authors of publication | Yoshida, Masaki; Kondo, Mio; Okamura, Masaya; Kanaike, Mari; Haesuwannakij, Setsiri; Sakurai, Hidehiro; Masaoka, Shigeyuki |
Journal of publication | Faraday Discuss. |
Year of publication | 2016 |
a | 8.9368 ± 0.0013 Å |
b | 17.315 ± 0.003 Å |
c | 20.91 ± 0.003 Å |
α | 90° |
β | 90° |
γ | 90° |
Cell volume | 3235.6 ± 0.9 Å3 |
Cell temperature | 123 ± 2 K |
Ambient diffraction temperature | 123 ± 2 K |
Number of distinct elements | 7 |
Space group number | 57 |
Hermann-Mauguin space group symbol | P b c m |
Hall space group symbol | -P 2c 2b |
Residual factor for all reflections | 0.0353 |
Residual factor for significantly intense reflections | 0.0315 |
Weighted residual factors for significantly intense reflections | 0.0712 |
Weighted residual factors for all reflections included in the refinement | 0.0735 |
Goodness-of-fit parameter for all reflections included in the refinement | 1.085 |
Diffraction radiation probe | x-ray |
Diffraction radiation wavelength | 0.71073 Å |
Diffraction radiation type | MoKα |