Information card for entry 1547154
Common name |
Co0.25Ti0.25Ta0.5O2 |
Formula |
Co0.25 O2 Ta0.5 Ti0.25 |
Calculated formula |
Co1.5 O12 Ta3 Ti1.5 |
Title of publication |
Synthesis of rutile-type solid solution Ni1-xCoxTi(Nb1-yTay)2O8 (0<=x<=1,0<=y<=1) and its optical property |
Authors of publication |
Kumada, N.; Koike, N.; Nakanome, K.; Yanagida, S.; Takei, T.; Miura, A.; Magome, E.; Moriyoshi, C.; Kuroiwa, Y. |
Journal of publication |
Journal of Asian Ceramic Societies |
Year of publication |
2017 |
Journal volume |
289 |
Pages of publication |
5 - 284 |
a |
4.7065 ± 0.0002 Å |
b |
4.7065 ± 0.0002 Å |
c |
9.1164 ± 0.0004 Å |
α |
90° |
β |
90° |
γ |
90° |
Cell volume |
201.939 ± 0.015 Å3 |
Number of distinct elements |
4 |
Space group number |
136 |
Hermann-Mauguin space group symbol |
P 42/m n m |
Hall space group symbol |
-P 4n 2n |
Yes |
No |
No |